[openssl-commits] Build failed in Jenkins: master_windows #1591

openssl.sanity at gmail.com openssl.sanity at gmail.com
Fri Apr 29 09:12:53 UTC 2016


See <https://openssl-sanity.cisco.com:8443/job/master_windows/1591/changes>

Changes:

[Richard Levitte] Fix BIO_set_nbio_accept()

[rsalz] Implement X509_STORE_CTX_set_current_cert() accessor

[rsalz] make update

[Richard Levitte] Add getters for X509_STORE and X509_OBJECT members

[rsalz] various spelling fixes

[rsalz] Fix an error code spelling.

[rsalz] Add checks on CRYPTO_new_ex_data return value

[rsalz] Add checks on CRYPTO_new_ex_data return value...

[fdasilvayy] BIO_free should call method->destroy before free'ing member fields

[Richard Levitte] apps/progs.pl: don't make digests disablable by default

[Richard Levitte] make update

[Matt Caswell] Fix a leak in i2b_PVK

[Matt Caswell] Don't free the BIGNUM passed to BN_mpi2bn

[Matt Caswell] Client side CKE processing can double free on error

[Matt Caswell] A call to RSA_set0_key had the arguments in the wrong order

[Matt Caswell] Remove some dead code

------------------------------------------
Started by upstream project "master_basic" build number 1855
originally caused by:
 Started by an SCM change
Building remotely on windows-slave in workspace <https://openssl-sanity.cisco.com:8443/job/master_windows/ws/>
 > git rev-parse --is-inside-work-tree # timeout=10
Fetching changes from the remote Git repository
 > git config remote.origin.url https://github.com/openssl/openssl.git # timeout=10
Fetching upstream changes from https://github.com/openssl/openssl.git
 > git --version # timeout=10
 > git -c core.askpass=true fetch --tags --progress https://github.com/openssl/openssl.git +refs/heads/*:refs/remotes/origin/*
 > git rev-parse "refs/remotes/origin/master^{commit}" # timeout=10
 > git rev-parse "refs/remotes/origin/origin/master^{commit}" # timeout=10
Checking out Revision 10a57adc606b86949007c076336e74970c2f336f (refs/remotes/origin/master)
 > git config core.sparsecheckout # timeout=10
 > git checkout -f 10a57adc606b86949007c076336e74970c2f336f
 > git rev-list b3bd3d5af8ed31f438db4367ce3a4bd43067e764 # timeout=10
[master_windows] $ cmd /c call C:\Users\ADMINI~1\AppData\Local\Temp\1\hudson1093637016108898500.bat

<https://openssl-sanity.cisco.com:8443/job/master_windows/ws/>call> "c:\program files (x86)\microsoft visual studio 12.0\vc\bin\vcvars32.bat" 

<https://openssl-sanity.cisco.com:8443/job/master_windows/ws/>set> PROCESSOR_ARCHITECTURE=x86 

<https://openssl-sanity.cisco.com:8443/job/master_windows/ws/>perl> Configure VC-WIN32 
Configuring OpenSSL version 1.1.0-pre6-dev (0x0x10100006L)
    no-crypto-mdebug [default]  OPENSSL_NO_CRYPTO_MDEBUG (skip dir)
    no-crypto-mdebug-backtrace [forced]   OPENSSL_NO_CRYPTO_MDEBUG_BACKTRACE (skip dir)
    no-ec_nistp_64_gcc_128 [default]  OPENSSL_NO_EC_NISTP_64_GCC_128 (skip dir)
    no-egd          [default]  OPENSSL_NO_EGD (skip dir)
    no-heartbeats   [default]  OPENSSL_NO_HEARTBEATS (skip dir)
    no-md2          [default]  OPENSSL_NO_MD2 (skip dir)
    no-rc5          [default]  OPENSSL_NO_RC5 (skip dir)
    no-sctp         [default]  OPENSSL_NO_SCTP (skip dir)
    no-ssl-trace    [default]  OPENSSL_NO_SSL_TRACE (skip dir)
    no-ssl3         [default]  OPENSSL_NO_SSL3 (skip dir)
    no-ssl3-method  [default]  OPENSSL_NO_SSL3_METHOD (skip dir)
    no-unit-test    [default]  OPENSSL_NO_UNIT_TEST (skip dir)
    no-weak-ssl-ciphers [default]  OPENSSL_NO_WEAK_SSL_CIPHERS (skip dir)
    no-zlib         [default] 
    no-zlib-dynamic [default] 
Configuring for VC-WIN32
CC            =cl
CFLAG         =-W3 -wd4090 -Gs0 -GF -Gy -nologo -DOPENSSL_SYS_WIN32 -DWIN32_LEAN_AND_MEAN -DL_ENDIAN -D_CRT_SECURE_NO_DEPRECATE -DUNICODE -D_UNICODE /MD /Ox /O2 /Ob2 
SHARED_CFLAG  =
DEFINES       =OPENSSL_USE_APPLINK DSO_WIN32 NDEBUG OPENSSL_THREADS OPENSSL_NO_STATIC_ENGINE OPENSSL_PIC OPENSSL_BN_ASM_PART_WORDS OPENSSL_IA32_SSE2 OPENSSL_BN_ASM_MONT OPENSSL_BN_ASM_GF2m SHA1_ASM SHA256_ASM SHA512_ASM MD5_ASM RMD160_ASM AES_ASM VPAES_ASM WHIRLPOOL_ASM GHASH_ASM ECP_NISTZ256_ASM POLY1305_ASM
LFLAG         =/nologo /debug
PLIB_LFLAG    =
EX_LIBS       =ws2_32.lib gdi32.lib advapi32.lib crypt32.lib user32.lib 
APPS_OBJ      =../ms/applink.o
CPUID_OBJ     =x86cpuid.o
UPLINK_OBJ    =../ms/uplink.o
BN_ASM        =bn-586.o co-586.o x86-mont.o x86-gf2m.o
EC_ASM        =ecp_nistz256.o ecp_nistz256-x86.o
DES_ENC       =des-586.o crypt586.o
AES_ENC       =aes-586.o vpaes-x86.o aesni-x86.o
BF_ENC        =bf-586.o
CAST_ENC      =c_enc.o
RC4_ENC       =rc4-586.o
RC5_ENC       =rc5-586.o
MD5_OBJ_ASM   =md5-586.o
SHA1_OBJ_ASM  =sha1-586.o sha256-586.o sha512-586.o
RMD160_OBJ_ASM=rmd-586.o
CMLL_ENC      =cmll-x86.o
MODES_OBJ     =ghash-x86.o
PADLOCK_OBJ   =e_padlock-x86.o
CHACHA_ENC    =chacha-x86.o
POLY1305_OBJ  =poly1305-x86.o
BLAKE2_OBJ    =
PROCESSOR     =
RANLIB        =true
ARFLAGS       =/nologo
PERL          =C:\Perl64\bin\perl.exe

THIRTY_TWO_BIT mode
BN_LLONG mode

Configured for VC-WIN32.

<https://openssl-sanity.cisco.com:8443/job/master_windows/ws/>exit> 0 
[master_windows] $ cmd /c call C:\Users\ADMINI~1\AppData\Local\Temp\1\hudson909514223673185392.bat

<https://openssl-sanity.cisco.com:8443/job/master_windows/ws/>call> "c:\program files (x86)\microsoft visual studio 12.0\vc\bin\vcvars32.bat" 

<https://openssl-sanity.cisco.com:8443/job/master_windows/ws/>set> PROCESSOR_ARCHITECTURE=x86 

<https://openssl-sanity.cisco.com:8443/job/master_windows/ws/>nmake>

Microsoft (R) Program Maintenance Utility Version 12.00.21005.1
Copyright (C) Microsoft Corporation.  All rights reserved.

	cl -DOPENSSL_USE_APPLINK -DDSO_WIN32 -DNDEBUG -DOPENSSL_THREADS -DOPENSSL_NO_STATIC_ENGINE -DOPENSSL_PIC -DOPENSSL_BN_ASM_PART_WORDS -DOPENSSL_IA32_SSE2 -DOPENSSL_BN_ASM_MONT -DOPENSSL_BN_ASM_GF2m -DSHA1_ASM -DSHA256_ASM -DSHA512_ASM -DMD5_ASM -DRMD160_ASM -DAES_ASM -DVPAES_ASM -DWHIRLPOOL_ASM -DGHASH_ASM -DECP_NISTZ256_ASM -DPOLY1305_ASM "-DENGINESDIR=\"%ProgramFiles(x86)%\\OpenSSL\\lib\\engines\"" "-DOPENSSLDIR=\"%CommonProgramFiles(x86)%\\SSL\"" -W3 -wd4090 -Gs0 -GF -Gy -nologo -DOPENSSL_SYS_WIN32 -DWIN32_LEAN_AND_MEAN -DL_ENDIAN -D_CRT_SECURE_NO_DEPRECATE -DUNICODE -D_UNICODE /MD /Ox /O2 /Ob2 /Zi /Fdlib /I include /I . /I crypto\include -c /Focrypto\asn1\bio_ndef.obj crypto\asn1\bio_ndef.c
bio_ndef.c
	cl -DOPENSSL_USE_APPLINK -DDSO_WIN32 -DNDEBUG -DOPENSSL_THREADS -DOPENSSL_NO_STATIC_ENGINE -DOPENSSL_PIC -DOPENSSL_BN_ASM_PART_WORDS -DOPENSSL_IA32_SSE2 -DOPENSSL_BN_ASM_MONT -DOPENSSL_BN_ASM_GF2m -DSHA1_ASM -DSHA256_ASM -DSHA512_ASM -DMD5_ASM -DRMD160_ASM -DAES_ASM -DVPAES_ASM -DWHIRLPOOL_ASM -DGHASH_ASM -DECP_NISTZ256_ASM -DPOLY1305_ASM "-DENGINESDIR=\"%ProgramFiles(x86)%\\OpenSSL\\lib\\engines\"" "-DOPENSSLDIR=\"%CommonProgramFiles(x86)%\\SSL\"" -W3 -wd4090 -Gs0 -GF -Gy -nologo -DOPENSSL_SYS_WIN32 -DWIN32_LEAN_AND_MEAN -DL_ENDIAN -D_CRT_SECURE_NO_DEPRECATE -DUNICODE -D_UNICODE /MD /Ox /O2 /Ob2 /Zi /Fdlib /I include /I . /I crypto\include -c /Focrypto\bio\b_addr.obj crypto\bio\b_addr.c
b_addr.c
crypto\bio\b_addr.c(278) : warning C4996: 'inet_ntoa': Use inet_ntop() or InetNtop() instead or define _WINSOCK_DEPRECATED_NO_WARNINGS to disable deprecated API warnings
        C:\Program Files (x86)\Windows Kits\8.1\include\um\winsock2.h(1868) : see declaration of 'inet_ntoa'
crypto\bio\b_addr.c(777) : warning C4996: 'gethostbyname': Use getaddrinfo() or GetAddrInfoW() instead or define _WINSOCK_DEPRECATED_NO_WARNINGS to disable deprecated API warnings
        C:\Program Files (x86)\Windows Kits\8.1\include\um\winsock2.h(2238) : see declaration of 'gethostbyname'
crypto\bio\b_addr.c(823) : warning C4244: 'function' : conversion from 'long' to 'u_short', possible loss of data
	cl -DOPENSSL_USE_APPLINK -DDSO_WIN32 -DNDEBUG -DOPENSSL_THREADS -DOPENSSL_NO_STATIC_ENGINE -DOPENSSL_PIC -DOPENSSL_BN_ASM_PART_WORDS -DOPENSSL_IA32_SSE2 -DOPENSSL_BN_ASM_MONT -DOPENSSL_BN_ASM_GF2m -DSHA1_ASM -DSHA256_ASM -DSHA512_ASM -DMD5_ASM -DRMD160_ASM -DAES_ASM -DVPAES_ASM -DWHIRLPOOL_ASM -DGHASH_ASM -DECP_NISTZ256_ASM -DPOLY1305_ASM "-DENGINESDIR=\"%ProgramFiles(x86)%\\OpenSSL\\lib\\engines\"" "-DOPENSSLDIR=\"%CommonProgramFiles(x86)%\\SSL\"" -W3 -wd4090 -Gs0 -GF -Gy -nologo -DOPENSSL_SYS_WIN32 -DWIN32_LEAN_AND_MEAN -DL_ENDIAN -D_CRT_SECURE_NO_DEPRECATE -DUNICODE -D_UNICODE /MD /Ox /O2 /Ob2 /Zi /Fdlib /I include /I . /I crypto\include -c /Focrypto\bio\bio_err.obj crypto\bio\bio_err.c
bio_err.c
	cl -DOPENSSL_USE_APPLINK -DDSO_WIN32 -DNDEBUG -DOPENSSL_THREADS -DOPENSSL_NO_STATIC_ENGINE -DOPENSSL_PIC -DOPENSSL_BN_ASM_PART_WORDS -DOPENSSL_IA32_SSE2 -DOPENSSL_BN_ASM_MONT -DOPENSSL_BN_ASM_GF2m -DSHA1_ASM -DSHA256_ASM -DSHA512_ASM -DMD5_ASM -DRMD160_ASM -DAES_ASM -DVPAES_ASM -DWHIRLPOOL_ASM -DGHASH_ASM -DECP_NISTZ256_ASM -DPOLY1305_ASM "-DENGINESDIR=\"%ProgramFiles(x86)%\\OpenSSL\\lib\\engines\"" "-DOPENSSLDIR=\"%CommonProgramFiles(x86)%\\SSL\"" -W3 -wd4090 -Gs0 -GF -Gy -nologo -DOPENSSL_SYS_WIN32 -DWIN32_LEAN_AND_MEAN -DL_ENDIAN -D_CRT_SECURE_NO_DEPRECATE -DUNICODE -D_UNICODE /MD /Ox /O2 /Ob2 /Zi /Fdlib /I include /I . /I crypto\include -c /Focrypto\bio\bio_lib.obj crypto\bio\bio_lib.c
bio_lib.c
	cl -DOPENSSL_USE_APPLINK -DDSO_WIN32 -DNDEBUG -DOPENSSL_THREADS -DOPENSSL_NO_STATIC_ENGINE -DOPENSSL_PIC -DOPENSSL_BN_ASM_PART_WORDS -DOPENSSL_IA32_SSE2 -DOPENSSL_BN_ASM_MONT -DOPENSSL_BN_ASM_GF2m -DSHA1_ASM -DSHA256_ASM -DSHA512_ASM -DMD5_ASM -DRMD160_ASM -DAES_ASM -DVPAES_ASM -DWHIRLPOOL_ASM -DGHASH_ASM -DECP_NISTZ256_ASM -DPOLY1305_ASM "-DENGINESDIR=\"%ProgramFiles(x86)%\\OpenSSL\\lib\\engines\"" "-DOPENSSLDIR=\"%CommonProgramFiles(x86)%\\SSL\"" -W3 -wd4090 -Gs0 -GF -Gy -nologo -DOPENSSL_SYS_WIN32 -DWIN32_LEAN_AND_MEAN -DL_ENDIAN -D_CRT_SECURE_NO_DEPRECATE -DUNICODE -D_UNICODE /MD /Ox /O2 /Ob2 /Zi /Fdlib /I include /I . /I crypto\include -c /Focrypto\bio\bss_acpt.obj crypto\bio\bss_acpt.c
bss_acpt.c
	cl -DOPENSSL_USE_APPLINK -DDSO_WIN32 -DNDEBUG -DOPENSSL_THREADS -DOPENSSL_NO_STATIC_ENGINE -DOPENSSL_PIC -DOPENSSL_BN_ASM_PART_WORDS -DOPENSSL_IA32_SSE2 -DOPENSSL_BN_ASM_MONT -DOPENSSL_BN_ASM_GF2m -DSHA1_ASM -DSHA256_ASM -DSHA512_ASM -DMD5_ASM -DRMD160_ASM -DAES_ASM -DVPAES_ASM -DWHIRLPOOL_ASM -DGHASH_ASM -DECP_NISTZ256_ASM -DPOLY1305_ASM "-DENGINESDIR=\"%ProgramFiles(x86)%\\OpenSSL\\lib\\engines\"" "-DOPENSSLDIR=\"%CommonProgramFiles(x86)%\\SSL\"" -W3 -wd4090 -Gs0 -GF -Gy -nologo -DOPENSSL_SYS_WIN32 -DWIN32_LEAN_AND_MEAN -DL_ENDIAN -D_CRT_SECURE_NO_DEPRECATE -DUNICODE -D_UNICODE /MD /Ox /O2 /Ob2 /Zi /Fdlib /I include /I . /I crypto\include -c /Focrypto\bn\bn_mpi.obj crypto\bn\bn_mpi.c
bn_mpi.c
	C:\Perl64\bin\perl.exe util\mkbuildinf.pl "cl " "VC-WIN32" > crypto\buildinf.h
	cl -DOPENSSL_USE_APPLINK -DDSO_WIN32 -DNDEBUG -DOPENSSL_THREADS -DOPENSSL_NO_STATIC_ENGINE -DOPENSSL_PIC -DOPENSSL_BN_ASM_PART_WORDS -DOPENSSL_IA32_SSE2 -DOPENSSL_BN_ASM_MONT -DOPENSSL_BN_ASM_GF2m -DSHA1_ASM -DSHA256_ASM -DSHA512_ASM -DMD5_ASM -DRMD160_ASM -DAES_ASM -DVPAES_ASM -DWHIRLPOOL_ASM -DGHASH_ASM -DECP_NISTZ256_ASM -DPOLY1305_ASM "-DENGINESDIR=\"%ProgramFiles(x86)%\\OpenSSL\\lib\\engines\"" "-DOPENSSLDIR=\"%CommonProgramFiles(x86)%\\SSL\"" -W3 -wd4090 -Gs0 -GF -Gy -nologo -DOPENSSL_SYS_WIN32 -DWIN32_LEAN_AND_MEAN -DL_ENDIAN -D_CRT_SECURE_NO_DEPRECATE -DUNICODE -D_UNICODE /MD /Ox /O2 /Ob2 /Zi /Fdlib /I include /I . /I crypto\include /I crypto -c /Focrypto\cversion.obj crypto\cversion.c
cversion.c
crypto\cversion.c(100) : warning C4129: 'P' : unrecognized character escape sequence
crypto\cversion.c(100) : warning C4129: 'C' : unrecognized character escape sequence
crypto\cversion.c(107) : warning C4129: 'P' : unrecognized character escape sequence
	cl -DOPENSSL_USE_APPLINK -DDSO_WIN32 -DNDEBUG -DOPENSSL_THREADS -DOPENSSL_NO_STATIC_ENGINE -DOPENSSL_PIC -DOPENSSL_BN_ASM_PART_WORDS -DOPENSSL_IA32_SSE2 -DOPENSSL_BN_ASM_MONT -DOPENSSL_BN_ASM_GF2m -DSHA1_ASM -DSHA256_ASM -DSHA512_ASM -DMD5_ASM -DRMD160_ASM -DAES_ASM -DVPAES_ASM -DWHIRLPOOL_ASM -DGHASH_ASM -DECP_NISTZ256_ASM -DPOLY1305_ASM "-DENGINESDIR=\"%ProgramFiles(x86)%\\OpenSSL\\lib\\engines\"" "-DOPENSSLDIR=\"%CommonProgramFiles(x86)%\\SSL\"" -W3 -wd4090 -Gs0 -GF -Gy -nologo -DOPENSSL_SYS_WIN32 -DWIN32_LEAN_AND_MEAN -DL_ENDIAN -D_CRT_SECURE_NO_DEPRECATE -DUNICODE -D_UNICODE /MD /Ox /O2 /Ob2 /Zi /Fdlib /I include /I . /I crypto\include -c /Focrypto\dh\dh_lib.obj crypto\dh\dh_lib.c
dh_lib.c
	cl -DOPENSSL_USE_APPLINK -DDSO_WIN32 -DNDEBUG -DOPENSSL_THREADS -DOPENSSL_NO_STATIC_ENGINE -DOPENSSL_PIC -DOPENSSL_BN_ASM_PART_WORDS -DOPENSSL_IA32_SSE2 -DOPENSSL_BN_ASM_MONT -DOPENSSL_BN_ASM_GF2m -DSHA1_ASM -DSHA256_ASM -DSHA512_ASM -DMD5_ASM -DRMD160_ASM -DAES_ASM -DVPAES_ASM -DWHIRLPOOL_ASM -DGHASH_ASM -DECP_NISTZ256_ASM -DPOLY1305_ASM "-DENGINESDIR=\"%ProgramFiles(x86)%\\OpenSSL\\lib\\engines\"" "-DOPENSSLDIR=\"%CommonProgramFiles(x86)%\\SSL\"" -W3 -wd4090 -Gs0 -GF -Gy -nologo -DOPENSSL_SYS_WIN32 -DWIN32_LEAN_AND_MEAN -DL_ENDIAN -D_CRT_SECURE_NO_DEPRECATE -DUNICODE -D_UNICODE /MD /Ox /O2 /Ob2 /Zi /Fdlib /I include /I . /I crypto\include -c /Focrypto\dsa\dsa_lib.obj crypto\dsa\dsa_lib.c
dsa_lib.c
	cl -DOPENSSL_USE_APPLINK -DDSO_WIN32 -DNDEBUG -DOPENSSL_THREADS -DOPENSSL_NO_STATIC_ENGINE -DOPENSSL_PIC -DOPENSSL_BN_ASM_PART_WORDS -DOPENSSL_IA32_SSE2 -DOPENSSL_BN_ASM_MONT -DOPENSSL_BN_ASM_GF2m -DSHA1_ASM -DSHA256_ASM -DSHA512_ASM -DMD5_ASM -DRMD160_ASM -DAES_ASM -DVPAES_ASM -DWHIRLPOOL_ASM -DGHASH_ASM -DECP_NISTZ256_ASM -DPOLY1305_ASM "-DENGINESDIR=\"%ProgramFiles(x86)%\\OpenSSL\\lib\\engines\"" "-DOPENSSLDIR=\"%CommonProgramFiles(x86)%\\SSL\"" -W3 -wd4090 -Gs0 -GF -Gy -nologo -DOPENSSL_SYS_WIN32 -DWIN32_LEAN_AND_MEAN -DL_ENDIAN -D_CRT_SECURE_NO_DEPRECATE -DUNICODE -D_UNICODE /MD /Ox /O2 /Ob2 /Zi /Fdlib /I include /I . /I crypto\include -c /Focrypto\dsa\dsa_ossl.obj crypto\dsa\dsa_ossl.c
dsa_ossl.c
	cl -DOPENSSL_USE_APPLINK -DDSO_WIN32 -DNDEBUG -DOPENSSL_THREADS -DOPENSSL_NO_STATIC_ENGINE -DOPENSSL_PIC -DOPENSSL_BN_ASM_PART_WORDS -DOPENSSL_IA32_SSE2 -DOPENSSL_BN_ASM_MONT -DOPENSSL_BN_ASM_GF2m -DSHA1_ASM -DSHA256_ASM -DSHA512_ASM -DMD5_ASM -DRMD160_ASM -DAES_ASM -DVPAES_ASM -DWHIRLPOOL_ASM -DGHASH_ASM -DECP_NISTZ256_ASM -DPOLY1305_ASM "-DENGINESDIR=\"%ProgramFiles(x86)%\\OpenSSL\\lib\\engines\"" "-DOPENSSLDIR=\"%CommonProgramFiles(x86)%\\SSL\"" -W3 -wd4090 -Gs0 -GF -Gy -nologo -DOPENSSL_SYS_WIN32 -DWIN32_LEAN_AND_MEAN -DL_ENDIAN -D_CRT_SECURE_NO_DEPRECATE -DUNICODE -D_UNICODE /MD /Ox /O2 /Ob2 /Zi /Fdlib /I include /I . /I crypto\include -c /Focrypto\engine\eng_lib.obj crypto\engine\eng_lib.c
eng_lib.c
	cl -DOPENSSL_USE_APPLINK -DDSO_WIN32 -DNDEBUG -DOPENSSL_THREADS -DOPENSSL_NO_STATIC_ENGINE -DOPENSSL_PIC -DOPENSSL_BN_ASM_PART_WORDS -DOPENSSL_IA32_SSE2 -DOPENSSL_BN_ASM_MONT -DOPENSSL_BN_ASM_GF2m -DSHA1_ASM -DSHA256_ASM -DSHA512_ASM -DMD5_ASM -DRMD160_ASM -DAES_ASM -DVPAES_ASM -DWHIRLPOOL_ASM -DGHASH_ASM -DECP_NISTZ256_ASM -DPOLY1305_ASM "-DENGINESDIR=\"%ProgramFiles(x86)%\\OpenSSL\\lib\\engines\"" "-DOPENSSLDIR=\"%CommonProgramFiles(x86)%\\SSL\"" -W3 -wd4090 -Gs0 -GF -Gy -nologo -DOPENSSL_SYS_WIN32 -DWIN32_LEAN_AND_MEAN -DL_ENDIAN -D_CRT_SECURE_NO_DEPRECATE -DUNICODE -D_UNICODE /MD /Ox /O2 /Ob2 /Zi /Fdlib /I include /I . /I crypto\include -c /Focrypto\pem\pvkfmt.obj crypto\pem\pvkfmt.c
pvkfmt.c
	cl -DOPENSSL_USE_APPLINK -DDSO_WIN32 -DNDEBUG -DOPENSSL_THREADS -DOPENSSL_NO_STATIC_ENGINE -DOPENSSL_PIC -DOPENSSL_BN_ASM_PART_WORDS -DOPENSSL_IA32_SSE2 -DOPENSSL_BN_ASM_MONT -DOPENSSL_BN_ASM_GF2m -DSHA1_ASM -DSHA256_ASM -DSHA512_ASM -DMD5_ASM -DRMD160_ASM -DAES_ASM -DVPAES_ASM -DWHIRLPOOL_ASM -DGHASH_ASM -DECP_NISTZ256_ASM -DPOLY1305_ASM "-DENGINESDIR=\"%ProgramFiles(x86)%\\OpenSSL\\lib\\engines\"" "-DOPENSSLDIR=\"%CommonProgramFiles(x86)%\\SSL\"" -W3 -wd4090 -Gs0 -GF -Gy -nologo -DOPENSSL_SYS_WIN32 -DWIN32_LEAN_AND_MEAN -DL_ENDIAN -D_CRT_SECURE_NO_DEPRECATE -DUNICODE -D_UNICODE /MD /Ox /O2 /Ob2 /Zi /Fdlib /I include /I . /I crypto\include -c /Focrypto\poly1305\poly1305.obj crypto\poly1305\poly1305.c
poly1305.c
	cl -DOPENSSL_USE_APPLINK -DDSO_WIN32 -DNDEBUG -DOPENSSL_THREADS -DOPENSSL_NO_STATIC_ENGINE -DOPENSSL_PIC -DOPENSSL_BN_ASM_PART_WORDS -DOPENSSL_IA32_SSE2 -DOPENSSL_BN_ASM_MONT -DOPENSSL_BN_ASM_GF2m -DSHA1_ASM -DSHA256_ASM -DSHA512_ASM -DMD5_ASM -DRMD160_ASM -DAES_ASM -DVPAES_ASM -DWHIRLPOOL_ASM -DGHASH_ASM -DECP_NISTZ256_ASM -DPOLY1305_ASM "-DENGINESDIR=\"%ProgramFiles(x86)%\\OpenSSL\\lib\\engines\"" "-DOPENSSLDIR=\"%CommonProgramFiles(x86)%\\SSL\"" -W3 -wd4090 -Gs0 -GF -Gy -nologo -DOPENSSL_SYS_WIN32 -DWIN32_LEAN_AND_MEAN -DL_ENDIAN -D_CRT_SECURE_NO_DEPRECATE -DUNICODE -D_UNICODE /MD /Ox /O2 /Ob2 /Zi /Fdlib /I include /I . /I crypto\include -c /Focrypto\srp\srp_vfy.obj crypto\srp\srp_vfy.c
srp_vfy.c
	cl -DOPENSSL_USE_APPLINK -DDSO_WIN32 -DNDEBUG -DOPENSSL_THREADS -DOPENSSL_NO_STATIC_ENGINE -DOPENSSL_PIC -DOPENSSL_BN_ASM_PART_WORDS -DOPENSSL_IA32_SSE2 -DOPENSSL_BN_ASM_MONT -DOPENSSL_BN_ASM_GF2m -DSHA1_ASM -DSHA256_ASM -DSHA512_ASM -DMD5_ASM -DRMD160_ASM -DAES_ASM -DVPAES_ASM -DWHIRLPOOL_ASM -DGHASH_ASM -DECP_NISTZ256_ASM -DPOLY1305_ASM "-DENGINESDIR=\"%ProgramFiles(x86)%\\OpenSSL\\lib\\engines\"" "-DOPENSSLDIR=\"%CommonProgramFiles(x86)%\\SSL\"" -W3 -wd4090 -Gs0 -GF -Gy -nologo -DOPENSSL_SYS_WIN32 -DWIN32_LEAN_AND_MEAN -DL_ENDIAN -D_CRT_SECURE_NO_DEPRECATE -DUNICODE -D_UNICODE /MD /Ox /O2 /Ob2 /Zi /Fdlib /I include /I . /I crypto\include -c /Focrypto\ui\ui_lib.obj crypto\ui\ui_lib.c
ui_lib.c
	cl -DOPENSSL_USE_APPLINK -DDSO_WIN32 -DNDEBUG -DOPENSSL_THREADS -DOPENSSL_NO_STATIC_ENGINE -DOPENSSL_PIC -DOPENSSL_BN_ASM_PART_WORDS -DOPENSSL_IA32_SSE2 -DOPENSSL_BN_ASM_MONT -DOPENSSL_BN_ASM_GF2m -DSHA1_ASM -DSHA256_ASM -DSHA512_ASM -DMD5_ASM -DRMD160_ASM -DAES_ASM -DVPAES_ASM -DWHIRLPOOL_ASM -DGHASH_ASM -DECP_NISTZ256_ASM -DPOLY1305_ASM "-DENGINESDIR=\"%ProgramFiles(x86)%\\OpenSSL\\lib\\engines\"" "-DOPENSSLDIR=\"%CommonProgramFiles(x86)%\\SSL\"" -W3 -wd4090 -Gs0 -GF -Gy -nologo -DOPENSSL_SYS_WIN32 -DWIN32_LEAN_AND_MEAN -DL_ENDIAN -D_CRT_SECURE_NO_DEPRECATE -DUNICODE -D_UNICODE /MD /Ox /O2 /Ob2 /Zi /Fdlib /I include /I . /I crypto\include -c /Focrypto\x509\x509_lu.obj crypto\x509\x509_lu.c
x509_lu.c
	cl -DOPENSSL_USE_APPLINK -DDSO_WIN32 -DNDEBUG -DOPENSSL_THREADS -DOPENSSL_NO_STATIC_ENGINE -DOPENSSL_PIC -DOPENSSL_BN_ASM_PART_WORDS -DOPENSSL_IA32_SSE2 -DOPENSSL_BN_ASM_MONT -DOPENSSL_BN_ASM_GF2m -DSHA1_ASM -DSHA256_ASM -DSHA512_ASM -DMD5_ASM -DRMD160_ASM -DAES_ASM -DVPAES_ASM -DWHIRLPOOL_ASM -DGHASH_ASM -DECP_NISTZ256_ASM -DPOLY1305_ASM "-DENGINESDIR=\"%ProgramFiles(x86)%\\OpenSSL\\lib\\engines\"" "-DOPENSSLDIR=\"%CommonProgramFiles(x86)%\\SSL\"" -W3 -wd4090 -Gs0 -GF -Gy -nologo -DOPENSSL_SYS_WIN32 -DWIN32_LEAN_AND_MEAN -DL_ENDIAN -D_CRT_SECURE_NO_DEPRECATE -DUNICODE -D_UNICODE /MD /Ox /O2 /Ob2 /Zi /Fdlib /I include /I . /I crypto\include -c /Focrypto\x509\x509_vfy.obj crypto\x509\x509_vfy.c
x509_vfy.c
	cl -DOPENSSL_USE_APPLINK -DDSO_WIN32 -DNDEBUG -DOPENSSL_THREADS -DOPENSSL_NO_STATIC_ENGINE -DOPENSSL_PIC -DOPENSSL_BN_ASM_PART_WORDS -DOPENSSL_IA32_SSE2 -DOPENSSL_BN_ASM_MONT -DOPENSSL_BN_ASM_GF2m -DSHA1_ASM -DSHA256_ASM -DSHA512_ASM -DMD5_ASM -DRMD160_ASM -DAES_ASM -DVPAES_ASM -DWHIRLPOOL_ASM -DGHASH_ASM -DECP_NISTZ256_ASM -DPOLY1305_ASM "-DENGINESDIR=\"%ProgramFiles(x86)%\\OpenSSL\\lib\\engines\"" "-DOPENSSLDIR=\"%CommonProgramFiles(x86)%\\SSL\"" -W3 -wd4090 -Gs0 -GF -Gy -nologo -DOPENSSL_SYS_WIN32 -DWIN32_LEAN_AND_MEAN -DL_ENDIAN -D_CRT_SECURE_NO_DEPRECATE -DUNICODE -D_UNICODE /MD /Ox /O2 /Ob2 /Zi /Fdlib /I include /I . /I crypto\include -c /Focrypto\x509\x_x509.obj crypto\x509\x_x509.c
x_x509.c
	C:\Perl64\bin\perl.exe util\mkdef.pl "crypto" 32 > libcrypto-1_1.def
	C:\Perl64\bin\perl.exe -i.tmp -pe "s|^LIBRARY\s+crypto32|LIBRARY libcrypto-1_1|;" libcrypto-1_1.def
	DEL libcrypto-1_1.def.tmp
	C:\Perl64\bin\perl.exe util\mkrc.pl libcrypto-1_1.dll > libcrypto-1_1.rc
	rc /folibcrypto-1_1.res libcrypto-1_1.rc
Microsoft (R) Windows (R) Resource Compiler Version 6.3.9600.17298

Copyright (C) Microsoft Corporation.  All rights reserved.


	link /nologo /debug /dll  /implib:libcrypto.lib /out:libcrypto-1_1.dll /def:libcrypto-1_1.def @C:\Users\ADMINI~1\AppData\Local\Temp\1\nmDF53.tmp || (DEL /Q libcrypto.* libcrypto-1_1.* && EXIT 1)
   Creating library libcrypto.lib and object libcrypto.exp
	DEL /F apps\libcrypto-1_1.dll
	DEL /F test\libcrypto-1_1.dll
	COPY libcrypto-1_1.dll apps
        1 file(s) copied.
	COPY libcrypto-1_1.dll test
        1 file(s) copied.
	cl -DOPENSSL_USE_APPLINK -DDSO_WIN32 -DNDEBUG -DOPENSSL_THREADS -DOPENSSL_NO_STATIC_ENGINE -DOPENSSL_PIC -DOPENSSL_BN_ASM_PART_WORDS -DOPENSSL_IA32_SSE2 -DOPENSSL_BN_ASM_MONT -DOPENSSL_BN_ASM_GF2m -DSHA1_ASM -DSHA256_ASM -DSHA512_ASM -DMD5_ASM -DRMD160_ASM -DAES_ASM -DVPAES_ASM -DWHIRLPOOL_ASM -DGHASH_ASM -DECP_NISTZ256_ASM -DPOLY1305_ASM "-DENGINESDIR=\"%ProgramFiles(x86)%\\OpenSSL\\lib\\engines\"" "-DOPENSSLDIR=\"%CommonProgramFiles(x86)%\\SSL\"" -W3 -wd4090 -Gs0 -GF -Gy -nologo -DOPENSSL_SYS_WIN32 -DWIN32_LEAN_AND_MEAN -DL_ENDIAN -D_CRT_SECURE_NO_DEPRECATE -DUNICODE -D_UNICODE /MD /Ox /O2 /Ob2 /Zi /Fdlib /I include /I . -c /Fossl\d1_lib.obj ssl\d1_lib.c
d1_lib.c
	cl -DOPENSSL_USE_APPLINK -DDSO_WIN32 -DNDEBUG -DOPENSSL_THREADS -DOPENSSL_NO_STATIC_ENGINE -DOPENSSL_PIC -DOPENSSL_BN_ASM_PART_WORDS -DOPENSSL_IA32_SSE2 -DOPENSSL_BN_ASM_MONT -DOPENSSL_BN_ASM_GF2m -DSHA1_ASM -DSHA256_ASM -DSHA512_ASM -DMD5_ASM -DRMD160_ASM -DAES_ASM -DVPAES_ASM -DWHIRLPOOL_ASM -DGHASH_ASM -DECP_NISTZ256_ASM -DPOLY1305_ASM "-DENGINESDIR=\"%ProgramFiles(x86)%\\OpenSSL\\lib\\engines\"" "-DOPENSSLDIR=\"%CommonProgramFiles(x86)%\\SSL\"" -W3 -wd4090 -Gs0 -GF -Gy -nologo -DOPENSSL_SYS_WIN32 -DWIN32_LEAN_AND_MEAN -DL_ENDIAN -D_CRT_SECURE_NO_DEPRECATE -DUNICODE -D_UNICODE /MD /Ox /O2 /Ob2 /Zi /Fdlib /I include /I . -c /Fossl\record\rec_layer_d1.obj ssl\record\rec_layer_d1.c
rec_layer_d1.c
ssl\record\rec_layer_d1.c(572) : warning C4146: unary minus operator applied to unsigned type, result still unsigned
	cl -DOPENSSL_USE_APPLINK -DDSO_WIN32 -DNDEBUG -DOPENSSL_THREADS -DOPENSSL_NO_STATIC_ENGINE -DOPENSSL_PIC -DOPENSSL_BN_ASM_PART_WORDS -DOPENSSL_IA32_SSE2 -DOPENSSL_BN_ASM_MONT -DOPENSSL_BN_ASM_GF2m -DSHA1_ASM -DSHA256_ASM -DSHA512_ASM -DMD5_ASM -DRMD160_ASM -DAES_ASM -DVPAES_ASM -DWHIRLPOOL_ASM -DGHASH_ASM -DECP_NISTZ256_ASM -DPOLY1305_ASM "-DENGINESDIR=\"%ProgramFiles(x86)%\\OpenSSL\\lib\\engines\"" "-DOPENSSLDIR=\"%CommonProgramFiles(x86)%\\SSL\"" -W3 -wd4090 -Gs0 -GF -Gy -nologo -DOPENSSL_SYS_WIN32 -DWIN32_LEAN_AND_MEAN -DL_ENDIAN -D_CRT_SECURE_NO_DEPRECATE -DUNICODE -D_UNICODE /MD /Ox /O2 /Ob2 /Zi /Fdlib /I include /I . -c /Fossl\record\rec_layer_s3.obj ssl\record\rec_layer_s3.c
rec_layer_s3.c
ssl\record\rec_layer_s3.c(829) : warning C4146: unary minus operator applied to unsigned type, result still unsigned
ssl\record\rec_layer_s3.c(1236) : warning C4146: unary minus operator applied to unsigned type, result still unsigned
	cl -DOPENSSL_USE_APPLINK -DDSO_WIN32 -DNDEBUG -DOPENSSL_THREADS -DOPENSSL_NO_STATIC_ENGINE -DOPENSSL_PIC -DOPENSSL_BN_ASM_PART_WORDS -DOPENSSL_IA32_SSE2 -DOPENSSL_BN_ASM_MONT -DOPENSSL_BN_ASM_GF2m -DSHA1_ASM -DSHA256_ASM -DSHA512_ASM -DMD5_ASM -DRMD160_ASM -DAES_ASM -DVPAES_ASM -DWHIRLPOOL_ASM -DGHASH_ASM -DECP_NISTZ256_ASM -DPOLY1305_ASM "-DENGINESDIR=\"%ProgramFiles(x86)%\\OpenSSL\\lib\\engines\"" "-DOPENSSLDIR=\"%CommonProgramFiles(x86)%\\SSL\"" -W3 -wd4090 -Gs0 -GF -Gy -nologo -DOPENSSL_SYS_WIN32 -DWIN32_LEAN_AND_MEAN -DL_ENDIAN -D_CRT_SECURE_NO_DEPRECATE -DUNICODE -D_UNICODE /MD /Ox /O2 /Ob2 /Zi /Fdlib /I include /I . -c /Fossl\s3_enc.obj ssl\s3_enc.c
s3_enc.c
	cl -DOPENSSL_USE_APPLINK -DDSO_WIN32 -DNDEBUG -DOPENSSL_THREADS -DOPENSSL_NO_STATIC_ENGINE -DOPENSSL_PIC -DOPENSSL_BN_ASM_PART_WORDS -DOPENSSL_IA32_SSE2 -DOPENSSL_BN_ASM_MONT -DOPENSSL_BN_ASM_GF2m -DSHA1_ASM -DSHA256_ASM -DSHA512_ASM -DMD5_ASM -DRMD160_ASM -DAES_ASM -DVPAES_ASM -DWHIRLPOOL_ASM -DGHASH_ASM -DECP_NISTZ256_ASM -DPOLY1305_ASM "-DENGINESDIR=\"%ProgramFiles(x86)%\\OpenSSL\\lib\\engines\"" "-DOPENSSLDIR=\"%CommonProgramFiles(x86)%\\SSL\"" -W3 -wd4090 -Gs0 -GF -Gy -nologo -DOPENSSL_SYS_WIN32 -DWIN32_LEAN_AND_MEAN -DL_ENDIAN -D_CRT_SECURE_NO_DEPRECATE -DUNICODE -D_UNICODE /MD /Ox /O2 /Ob2 /Zi /Fdlib /I include /I . -c /Fossl\s3_lib.obj ssl\s3_lib.c
s3_lib.c
	cl -DOPENSSL_USE_APPLINK -DDSO_WIN32 -DNDEBUG -DOPENSSL_THREADS -DOPENSSL_NO_STATIC_ENGINE -DOPENSSL_PIC -DOPENSSL_BN_ASM_PART_WORDS -DOPENSSL_IA32_SSE2 -DOPENSSL_BN_ASM_MONT -DOPENSSL_BN_ASM_GF2m -DSHA1_ASM -DSHA256_ASM -DSHA512_ASM -DMD5_ASM -DRMD160_ASM -DAES_ASM -DVPAES_ASM -DWHIRLPOOL_ASM -DGHASH_ASM -DECP_NISTZ256_ASM -DPOLY1305_ASM "-DENGINESDIR=\"%ProgramFiles(x86)%\\OpenSSL\\lib\\engines\"" "-DOPENSSLDIR=\"%CommonProgramFiles(x86)%\\SSL\"" -W3 -wd4090 -Gs0 -GF -Gy -nologo -DOPENSSL_SYS_WIN32 -DWIN32_LEAN_AND_MEAN -DL_ENDIAN -D_CRT_SECURE_NO_DEPRECATE -DUNICODE -D_UNICODE /MD /Ox /O2 /Ob2 /Zi /Fdlib /I include /I . -c /Fossl\ssl_cert.obj ssl\ssl_cert.c
ssl_cert.c
	cl -DOPENSSL_USE_APPLINK -DDSO_WIN32 -DNDEBUG -DOPENSSL_THREADS -DOPENSSL_NO_STATIC_ENGINE -DOPENSSL_PIC -DOPENSSL_BN_ASM_PART_WORDS -DOPENSSL_IA32_SSE2 -DOPENSSL_BN_ASM_MONT -DOPENSSL_BN_ASM_GF2m -DSHA1_ASM -DSHA256_ASM -DSHA512_ASM -DMD5_ASM -DRMD160_ASM -DAES_ASM -DVPAES_ASM -DWHIRLPOOL_ASM -DGHASH_ASM -DECP_NISTZ256_ASM -DPOLY1305_ASM "-DENGINESDIR=\"%ProgramFiles(x86)%\\OpenSSL\\lib\\engines\"" "-DOPENSSLDIR=\"%CommonProgramFiles(x86)%\\SSL\"" -W3 -wd4090 -Gs0 -GF -Gy -nologo -DOPENSSL_SYS_WIN32 -DWIN32_LEAN_AND_MEAN -DL_ENDIAN -D_CRT_SECURE_NO_DEPRECATE -DUNICODE -D_UNICODE /MD /Ox /O2 /Ob2 /Zi /Fdlib /I include /I . -c /Fossl\ssl_err.obj ssl\ssl_err.c
ssl_err.c
	cl -DOPENSSL_USE_APPLINK -DDSO_WIN32 -DNDEBUG -DOPENSSL_THREADS -DOPENSSL_NO_STATIC_ENGINE -DOPENSSL_PIC -DOPENSSL_BN_ASM_PART_WORDS -DOPENSSL_IA32_SSE2 -DOPENSSL_BN_ASM_MONT -DOPENSSL_BN_ASM_GF2m -DSHA1_ASM -DSHA256_ASM -DSHA512_ASM -DMD5_ASM -DRMD160_ASM -DAES_ASM -DVPAES_ASM -DWHIRLPOOL_ASM -DGHASH_ASM -DECP_NISTZ256_ASM -DPOLY1305_ASM "-DENGINESDIR=\"%ProgramFiles(x86)%\\OpenSSL\\lib\\engines\"" "-DOPENSSLDIR=\"%CommonProgramFiles(x86)%\\SSL\"" -W3 -wd4090 -Gs0 -GF -Gy -nologo -DOPENSSL_SYS_WIN32 -DWIN32_LEAN_AND_MEAN -DL_ENDIAN -D_CRT_SECURE_NO_DEPRECATE -DUNICODE -D_UNICODE /MD /Ox /O2 /Ob2 /Zi /Fdlib /I include /I . -c /Fossl\ssl_lib.obj ssl\ssl_lib.c
ssl_lib.c
	cl -DOPENSSL_USE_APPLINK -DDSO_WIN32 -DNDEBUG -DOPENSSL_THREADS -DOPENSSL_NO_STATIC_ENGINE -DOPENSSL_PIC -DOPENSSL_BN_ASM_PART_WORDS -DOPENSSL_IA32_SSE2 -DOPENSSL_BN_ASM_MONT -DOPENSSL_BN_ASM_GF2m -DSHA1_ASM -DSHA256_ASM -DSHA512_ASM -DMD5_ASM -DRMD160_ASM -DAES_ASM -DVPAES_ASM -DWHIRLPOOL_ASM -DGHASH_ASM -DECP_NISTZ256_ASM -DPOLY1305_ASM "-DENGINESDIR=\"%ProgramFiles(x86)%\\OpenSSL\\lib\\engines\"" "-DOPENSSLDIR=\"%CommonProgramFiles(x86)%\\SSL\"" -W3 -wd4090 -Gs0 -GF -Gy -nologo -DOPENSSL_SYS_WIN32 -DWIN32_LEAN_AND_MEAN -DL_ENDIAN -D_CRT_SECURE_NO_DEPRECATE -DUNICODE -D_UNICODE /MD /Ox /O2 /Ob2 /Zi /Fdlib /I include /I . -c /Fossl\ssl_sess.obj ssl\ssl_sess.c
ssl_sess.c
	cl -DOPENSSL_USE_APPLINK -DDSO_WIN32 -DNDEBUG -DOPENSSL_THREADS -DOPENSSL_NO_STATIC_ENGINE -DOPENSSL_PIC -DOPENSSL_BN_ASM_PART_WORDS -DOPENSSL_IA32_SSE2 -DOPENSSL_BN_ASM_MONT -DOPENSSL_BN_ASM_GF2m -DSHA1_ASM -DSHA256_ASM -DSHA512_ASM -DMD5_ASM -DRMD160_ASM -DAES_ASM -DVPAES_ASM -DWHIRLPOOL_ASM -DGHASH_ASM -DECP_NISTZ256_ASM -DPOLY1305_ASM "-DENGINESDIR=\"%ProgramFiles(x86)%\\OpenSSL\\lib\\engines\"" "-DOPENSSLDIR=\"%CommonProgramFiles(x86)%\\SSL\"" -W3 -wd4090 -Gs0 -GF -Gy -nologo -DOPENSSL_SYS_WIN32 -DWIN32_LEAN_AND_MEAN -DL_ENDIAN -D_CRT_SECURE_NO_DEPRECATE -DUNICODE -D_UNICODE /MD /Ox /O2 /Ob2 /Zi /Fdlib /I include /I . -c /Fossl\ssl_txt.obj ssl\ssl_txt.c
ssl_txt.c
	cl -DOPENSSL_USE_APPLINK -DDSO_WIN32 -DNDEBUG -DOPENSSL_THREADS -DOPENSSL_NO_STATIC_ENGINE -DOPENSSL_PIC -DOPENSSL_BN_ASM_PART_WORDS -DOPENSSL_IA32_SSE2 -DOPENSSL_BN_ASM_MONT -DOPENSSL_BN_ASM_GF2m -DSHA1_ASM -DSHA256_ASM -DSHA512_ASM -DMD5_ASM -DRMD160_ASM -DAES_ASM -DVPAES_ASM -DWHIRLPOOL_ASM -DGHASH_ASM -DECP_NISTZ256_ASM -DPOLY1305_ASM "-DENGINESDIR=\"%ProgramFiles(x86)%\\OpenSSL\\lib\\engines\"" "-DOPENSSLDIR=\"%CommonProgramFiles(x86)%\\SSL\"" -W3 -wd4090 -Gs0 -GF -Gy -nologo -DOPENSSL_SYS_WIN32 -DWIN32_LEAN_AND_MEAN -DL_ENDIAN -D_CRT_SECURE_NO_DEPRECATE -DUNICODE -D_UNICODE /MD /Ox /O2 /Ob2 /Zi /Fdlib /I include /I . -c /Fossl\statem\statem_clnt.obj ssl\statem\statem_clnt.c
statem_clnt.c
	cl -DOPENSSL_USE_APPLINK -DDSO_WIN32 -DNDEBUG -DOPENSSL_THREADS -DOPENSSL_NO_STATIC_ENGINE -DOPENSSL_PIC -DOPENSSL_BN_ASM_PART_WORDS -DOPENSSL_IA32_SSE2 -DOPENSSL_BN_ASM_MONT -DOPENSSL_BN_ASM_GF2m -DSHA1_ASM -DSHA256_ASM -DSHA512_ASM -DMD5_ASM -DRMD160_ASM -DAES_ASM -DVPAES_ASM -DWHIRLPOOL_ASM -DGHASH_ASM -DECP_NISTZ256_ASM -DPOLY1305_ASM "-DENGINESDIR=\"%ProgramFiles(x86)%\\OpenSSL\\lib\\engines\"" "-DOPENSSLDIR=\"%CommonProgramFiles(x86)%\\SSL\"" -W3 -wd4090 -Gs0 -GF -Gy -nologo -DOPENSSL_SYS_WIN32 -DWIN32_LEAN_AND_MEAN -DL_ENDIAN -D_CRT_SECURE_NO_DEPRECATE -DUNICODE -D_UNICODE /MD /Ox /O2 /Ob2 /Zi /Fdlib /I include /I . -c /Fossl\statem\statem_srvr.obj ssl\statem\statem_srvr.c
statem_srvr.c
	cl -DOPENSSL_USE_APPLINK -DDSO_WIN32 -DNDEBUG -DOPENSSL_THREADS -DOPENSSL_NO_STATIC_ENGINE -DOPENSSL_PIC -DOPENSSL_BN_ASM_PART_WORDS -DOPENSSL_IA32_SSE2 -DOPENSSL_BN_ASM_MONT -DOPENSSL_BN_ASM_GF2m -DSHA1_ASM -DSHA256_ASM -DSHA512_ASM -DMD5_ASM -DRMD160_ASM -DAES_ASM -DVPAES_ASM -DWHIRLPOOL_ASM -DGHASH_ASM -DECP_NISTZ256_ASM -DPOLY1305_ASM "-DENGINESDIR=\"%ProgramFiles(x86)%\\OpenSSL\\lib\\engines\"" "-DOPENSSLDIR=\"%CommonProgramFiles(x86)%\\SSL\"" -W3 -wd4090 -Gs0 -GF -Gy -nologo -DOPENSSL_SYS_WIN32 -DWIN32_LEAN_AND_MEAN -DL_ENDIAN -D_CRT_SECURE_NO_DEPRECATE -DUNICODE -D_UNICODE /MD /Ox /O2 /Ob2 /Zi /Fdlib /I include /I . -c /Fossl\t1_lib.obj ssl\t1_lib.c
t1_lib.c
	C:\Perl64\bin\perl.exe util\mkdef.pl "ssl" 32 > libssl-1_1.def
	C:\Perl64\bin\perl.exe -i.tmp -pe "s|^LIBRARY\s+ssl32|LIBRARY libssl-1_1|;" libssl-1_1.def
	DEL libssl-1_1.def.tmp
	C:\Perl64\bin\perl.exe util\mkrc.pl libssl-1_1.dll > libssl-1_1.rc
	rc /folibssl-1_1.res libssl-1_1.rc
Microsoft (R) Windows (R) Resource Compiler Version 6.3.9600.17298

Copyright (C) Microsoft Corporation.  All rights reserved.


	link /nologo /debug /dll  /implib:libssl.lib /out:libssl-1_1.dll /def:libssl-1_1.def @C:\Users\ADMINI~1\AppData\Local\Temp\1\nmFA6E.tmp || (DEL /Q libssl.* libssl-1_1.* && EXIT 1)
   Creating library libssl.lib and object libssl.exp
	DEL /F apps\libssl-1_1.dll
	DEL /F test\libssl-1_1.dll
	COPY libssl-1_1.dll apps
        1 file(s) copied.
	COPY libssl-1_1.dll test
        1 file(s) copied.
	link /nologo /debug /dll /out:engines\capi.dll /def:C:\Users\ADMINI~1\AppData\Local\Temp\1\nmFC34.tmp @C:\Users\ADMINI~1\AppData\Local\Temp\1\nmFC35.tmp
   Creating library engines\capi.lib and object engines\capi.exp
	link /nologo /debug /dll /out:engines\dasync.dll /def:C:\Users\ADMINI~1\AppData\Local\Temp\1\nmFCB3.tmp @C:\Users\ADMINI~1\AppData\Local\Temp\1\nmFCB4.tmp
   Creating library engines\dasync.lib and object engines\dasync.exp
	link /nologo /debug /dll /out:engines\ossltest.dll /def:C:\Users\ADMINI~1\AppData\Local\Temp\1\nmFD32.tmp @C:\Users\ADMINI~1\AppData\Local\Temp\1\nmFD33.tmp
   Creating library engines\ossltest.lib and object engines\ossltest.exp
	link /nologo /debug /dll /out:engines\padlock.dll /def:C:\Users\ADMINI~1\AppData\Local\Temp\1\nmFDA1.tmp @C:\Users\ADMINI~1\AppData\Local\Temp\1\nmFDA2.tmp
   Creating library engines\padlock.lib and object engines\padlock.exp
	cl -DOPENSSL_USE_APPLINK -DDSO_WIN32 -DNDEBUG -DOPENSSL_THREADS -DOPENSSL_NO_STATIC_ENGINE -DOPENSSL_PIC -DOPENSSL_BN_ASM_PART_WORDS -DOPENSSL_IA32_SSE2 -DOPENSSL_BN_ASM_MONT -DOPENSSL_BN_ASM_GF2m -DSHA1_ASM -DSHA256_ASM -DSHA512_ASM -DMD5_ASM -DRMD160_ASM -DAES_ASM -DVPAES_ASM -DWHIRLPOOL_ASM -DGHASH_ASM -DECP_NISTZ256_ASM -DPOLY1305_ASM "-DENGINESDIR=\"%ProgramFiles(x86)%\\OpenSSL\\lib\\engines\"" "-DOPENSSLDIR=\"%CommonProgramFiles(x86)%\\SSL\"" -W3 -wd4090 -Gs0 -GF -Gy -nologo -DOPENSSL_SYS_WIN32 -DWIN32_LEAN_AND_MEAN -DL_ENDIAN -D_CRT_SECURE_NO_DEPRECATE -DUNICODE -D_UNICODE /MD /Ox /O2 /Ob2 /Zi /Fdapp /I include /I . -c /Foapps\apps.obj apps\apps.c
apps.c
apps\apps.c(2557) : warning C4996: 'open': The POSIX name for this item is deprecated. Instead, use the ISO C++ conformant name: _open. See online help for details.
        C:\Program Files (x86)\Microsoft Visual Studio 12.0\VC\INCLUDE\io.h(336) : see declaration of 'open'
apps\apps.c(2560) : warning C4996: 'fdopen': The POSIX name for this item is deprecated. Instead, use the ISO C++ conformant name: _fdopen. See online help for details.
        C:\Program Files (x86)\Microsoft Visual Studio 12.0\VC\INCLUDE\stdio.h(716) : see declaration of 'fdopen'
apps\apps.c(2578) : warning C4996: 'close': The POSIX name for this item is deprecated. Instead, use the ISO C++ conformant name: _close. See online help for details.
        C:\Program Files (x86)\Microsoft Visual Studio 12.0\VC\INCLUDE\io.h(326) : see declaration of 'close'
	link /nologo /debug /subsystem:console /opt:ref /out:apps\openssl.exe @C:\Users\ADMINI~1\AppData\Local\Temp\1\nmFF69.tmp
MSVCRT.lib(MSVCR120.dll) : error LNK2005: ___iob_func already defined in LIBCMT.lib(_file.obj)
MSVCRT.lib(MSVCR120.dll) : error LNK2005: _fclose already defined in LIBCMT.lib(fclose.obj)
MSVCRT.lib(MSVCR120.dll) : error LNK2005: _perror already defined in LIBCMT.lib(perror.obj)
MSVCRT.lib(MSVCR120.dll) : error LNK2005: __errno already defined in LIBCMT.lib(dosmap.obj)
MSVCRT.lib(MSVCR120.dll) : error LNK2005: _exit already defined in LIBCMT.lib(crt0dat.obj)
MSVCRT.lib(MSVCR120.dll) : error LNK2005: _getenv already defined in LIBCMT.lib(getenv.obj)
MSVCRT.lib(MSVCR120.dll) : error LNK2005: _free already defined in LIBCMT.lib(free.obj)
MSVCRT.lib(MSVCR120.dll) : error LNK2005: _malloc already defined in LIBCMT.lib(malloc.obj)
MSVCRT.lib(MSVCR120.dll) : error LNK2005: _strchr already defined in LIBCMT.lib(strchr.obj)
MSVCRT.lib(MSVCR120.dll) : error LNK2005: __stricmp already defined in LIBCMT.lib(stricmp.obj)
MSVCRT.lib(MSVCR120.dll) : error LNK2005: _isspace already defined in LIBCMT.lib(_ctype.obj)
MSVCRT.lib(MSVCR120.dll) : error LNK2005: _atoi already defined in LIBCMT.lib(atox.obj)
MSVCRT.lib(MSVCR120.dll) : error LNK2005: _strtol already defined in LIBCMT.lib(strtol.obj)
MSVCRT.lib(MSVCR120.dll) : error LNK2005: _atol already defined in LIBCMT.lib(atox.obj)
MSVCRT.lib(MSVCR120.dll) : error LNK2005: _isxdigit already defined in LIBCMT.lib(_ctype.obj)
MSVCRT.lib(MSVCR120.dll) : error LNK2005: _printf already defined in LIBCMT.lib(printf.obj)
MSVCRT.lib(MSVCR120.dll) : error LNK2005: _islower already defined in LIBCMT.lib(_ctype.obj)
MSVCRT.lib(MSVCR120.dll) : error LNK2005: _fflush already defined in LIBCMT.lib(fflush.obj)
MSVCRT.lib(MSVCR120.dll) : error LNK2005: _isupper already defined in LIBCMT.lib(_ctype.obj)
MSVCRT.lib(MSVCR120.dll) : error LNK2005: _tolower already defined in LIBCMT.lib(tolower.obj)
MSVCRT.lib(MSVCR120.dll) : error LNK2005: _strtoul already defined in LIBCMT.lib(strtol.obj)
MSVCRT.lib(MSVCR120.dll) : error LNK2005: _strstr already defined in LIBCMT.lib(strstr.obj)
MSVCRT.lib(MSVCR120.dll) : error LNK2005: __time64 already defined in LIBCMT.lib(time64.obj)
MSVCRT.lib(MSVCR120.dll) : error LNK2005: __fileno already defined in LIBCMT.lib(fileno.obj)
MSVCRT.lib(MSVCR120.dll) : error LNK2005: __close already defined in LIBCMT.lib(close.obj)
MSVCRT.lib(MSVCR120.dll) : error LNK2005: __write already defined in LIBCMT.lib(write.obj)
   Creating library apps\openssl.lib and object apps\openssl.exp
LINK : warning LNK4098: defaultlib 'MSVCRT' conflicts with use of other libs; use /NODEFAULTLIB:library
apps\openssl.exe : fatal error LNK1169: one or more multiply defined symbols found
NMAKE : fatal error U1077: '"C:\Program Files (x86)\Microsoft Visual Studio 12.0\VC\BIN\link.EXE"' : return code '0x491'
Stop.

<https://openssl-sanity.cisco.com:8443/job/master_windows/ws/>exit> 2 
Build step 'Execute Windows batch command' marked build as failure


More information about the openssl-commits mailing list