[openssl-commits] Build failed in Jenkins: master_mips_noasm #497

openssl.sanity at gmail.com openssl.sanity at gmail.com
Mon Feb 1 13:45:00 UTC 2016

See <https://openssl-sanity.cisco.com:8443/job/master_mips_noasm/497/changes>


[steve] Use PKCS#8 format EC key so test is skipped with no-ec

[rsalz] Comment "secure memcmp" implementation

Started by upstream project "master_basic" build number 1581
originally caused by:
 Started by an SCM change
Building on master in workspace <https://openssl-sanity.cisco.com:8443/job/master_mips_noasm/ws/>
 > git rev-parse --is-inside-work-tree # timeout=10
Fetching changes from the remote Git repository
 > git config remote.origin.url https://github.com/openssl/openssl.git # timeout=10
Fetching upstream changes from https://github.com/openssl/openssl.git
 > git --version # timeout=10
 > git -c core.askpass=true fetch --tags --progress https://github.com/openssl/openssl.git +refs/heads/*:refs/remotes/origin/*
 > git rev-parse refs/remotes/origin/master^{commit} # timeout=10
 > git rev-parse refs/remotes/origin/origin/master^{commit} # timeout=10
Checking out Revision eb507efba8e2333a284a2a79638f729bdc35c502 (refs/remotes/origin/master)
 > git config core.sparsecheckout # timeout=10
 > git checkout -f eb507efba8e2333a284a2a79638f729bdc35c502
 > git rev-list 8ffdf7ffd7b649068521c635baa2d0a9fd89914a # timeout=10
[master_mips_noasm] $ /bin/sh -xe /tmp/hudson8103435716270252641.sh
+ export PATH=/sbin:/usr/sbin:/bin:/usr/bin:/var/toolchains/Octeon/octeon_sdk/tools-gcc-4.3/bin
+ PATH=/sbin:/usr/sbin:/bin:/usr/bin:/var/toolchains/Octeon/octeon_sdk/tools-gcc-4.3/bin
+ export CROSS_COMPILE=mips64-octeon-linux-gnu-
+ CROSS_COMPILE=mips64-octeon-linux-gnu-
+ ./Configure linux64-mips64 no-asm no-shared
Configuring OpenSSL version 1.1.0-pre3-dev (0x0x10100003L)
    no-asm          [option]   OPENSSL_NO_ASM
    no-crypto-mdebug [default]  OPENSSL_NO_CRYPTO_MDEBUG (skip dir)
    no-ec_nistp_64_gcc_128 [default]  OPENSSL_NO_EC_NISTP_64_GCC_128 (skip dir)
    no-egd          [default]  OPENSSL_NO_EGD (skip dir)
    no-jpake        [experimental] OPENSSL_NO_JPAKE (skip dir)
    no-md2          [default]  OPENSSL_NO_MD2 (skip dir)
    no-rc5          [default]  OPENSSL_NO_RC5 (skip dir)
    no-sctp         [default]  OPENSSL_NO_SCTP (skip dir)
    no-shared       [option]  
    no-ssl-trace    [default]  OPENSSL_NO_SSL_TRACE (skip dir)
    no-store        [experimental] OPENSSL_NO_STORE (skip dir)
    no-unit-test    [default]  OPENSSL_NO_UNIT_TEST (skip dir)
    no-zlib         [default] 
    no-zlib-dynamic [default] 
Configuring for linux64-mips64
IsMK1MF       =no
CC            =gcc
CFLAG         =-DOPENSSL_THREADS -pthread -DDSO_DLFCN -DHAVE_DLFCN_H -mabi=64 -O3 -Wall -DBN_DIV3W -O3
LFLAGS        =
EX_LIBS       =-ldl
CPUID_OBJ     =mem_clr.o
BN_ASM        =bn_asm.o
EC_ASM        =
DES_ENC       =des_enc.o fcrypt_b.o
AES_ENC       =aes_core.o aes_cbc.o
BF_ENC        =bf_enc.o
CAST_ENC      =c_enc.o
RC4_ENC       =rc4_enc.o rc4_skey.o
RC5_ENC       =rc5_enc.o
CMLL_ENC      =camellia.o cmll_misc.o cmll_cbc.o
CHACHA_ENC    =chacha_enc.o
POLY1305_OBJ  =
RANLIB        =/bin/ranlib
ARFLAGS       =
PERL          =/bin/perl


Configured for linux64-mips64.

*** Because of configuration changes, you MUST do the following before
*** building:

	make depend
+ make depend
making depend in crypto...
make[1]: Entering directory `<https://openssl-sanity.cisco.com:8443/job/master_mips_noasm/ws/crypto'>
gcc: error: unrecognized argument in option '-mabi=64'
gcc: note: valid arguments to '-mabi=' are: ms sysv
make[1]: *** [depend] Error 1
make[1]: Leaving directory `<https://openssl-sanity.cisco.com:8443/job/master_mips_noasm/ws/crypto'>
make: *** [depend] Error 1
Build step 'Execute shell' marked build as failure

More information about the openssl-commits mailing list