FAILED build of OpenSSL branch master with options -d --strict-warnings no-engine no-shared

OpenSSL run-checker openssl at openssl.org
Fri Nov 8 04:52:48 UTC 2019


Platform and configuration command:

$ uname -a
Linux run 4.15.0-54-generic #58-Ubuntu SMP Mon Jun 24 10:55:24 UTC 2019 x86_64 x86_64 x86_64 GNU/Linux
$ CC=clang ../openssl/config -d --strict-warnings no-engine no-shared

Commit log since last time:

5388f9862d Add "sections" to -help output
ab14d2af53 Add a test for EVP_PKEY_keymake() and EVP_PKEY_make()
46e2dd05ef Add EVP functionality to create domain params and keys by user data
54a0d4ceb2 Update INSTALL to document the changed '--api' and 'no-deprecated'
686923b198 include/openssl/asn1.h: Remove version dependent inclusion of <openssl/bn.h>
a3844061df Update the check surround the BN_zero() implementation
285a0db396 Update some inclusions of <openssl/macros.h>
9fd9951e4b include/openssl/opensslconf.h.in: remove spurious HEADER_FILE_H definition
00db8c60aa Update source files for pre-3.0 deprecation
936c2b9e93 Update source files for deprecation at 3.0
a6a4d0acd2 Change the logic and behaviour surrounding '--api' and 'no-deprecated'
ccd9e70d4e Strip much out of ssl.pod
98ca37e4aa Add L<ssl(7)> to all SSL pages
16f8a61830 Remove outdated info from man7/ssl
eee5f32f37 Test EVP_get_[digest|cipher]byname() use the namemap
7606bed904 Ensure EVP_get_digestbyname() and EVP_get_cipherbyname() know all aliases

Build log ended with (last 100 lines):

70-test_asyncio.t .................. ok
70-test_bad_dtls.t ................. ok
70-test_clienthello.t .............. ok
70-test_comp.t ..................... skipped: test_comp needs the dynamic engine feature enabled
70-test_key_share.t ................ skipped: test_key_share needs the dynamic engine feature enabled
70-test_packet.t ................... ok
70-test_recordlen.t ................ ok
70-test_renegotiation.t ............ skipped: test_renegotiation needs the dynamic engine feature enabled
70-test_servername.t ............... ok
70-test_sslcbcpadding.t ............ skipped: test_sslcbcpadding needs the dynamic engine feature enabled
70-test_sslcertstatus.t ............ skipped: test_sslcertstatus needs the dynamic engine feature enabled
70-test_sslextension.t ............. skipped: test_sslextension needs the dynamic engine feature enabled
70-test_sslmessages.t .............. skipped: test_sslmessages needs the dynamic engine feature enabled
70-test_sslrecords.t ............... skipped: test_sslrecords needs the dynamic engine feature enabled
70-test_sslsessiontick.t ........... skipped: test_sslsessiontick needs the dynamic engine feature enabled
70-test_sslsigalgs.t ............... skipped: test_sslsigalgs needs the dynamic engine feature enabled
70-test_sslsignature.t ............. skipped: test_sslsignature needs the dynamic engine feature enabled
70-test_sslskewith0p.t ............. skipped: test_sslskewith0p needs the dynamic engine feature enabled
70-test_sslversions.t .............. skipped: test_sslversions needs the dynamic engine feature enabled
70-test_sslvertol.t ................ skipped: test_sslextension needs the dynamic engine feature enabled
70-test_tls13alerts.t .............. skipped: test_tls13alerts needs the dynamic engine feature enabled
70-test_tls13cookie.t .............. skipped: test_tls13cookie needs the dynamic engine feature enabled
70-test_tls13downgrade.t ........... skipped: test_tls13downgrade needs the dynamic engine feature enabled
70-test_tls13hrr.t ................. skipped: test_tls13hrr needs the dynamic engine feature enabled
70-test_tls13kexmodes.t ............ skipped: test_tls13kexmodes needs the dynamic engine feature enabled
70-test_tls13messages.t ............ skipped: test_tls13messages needs the dynamic engine feature enabled
70-test_tls13psk.t ................. skipped: test_tls13psk needs the dynamic engine feature enabled
70-test_tlsextms.t ................. skipped: test_tlsextms needs the dynamic engine feature enabled
70-test_verify_extra.t ............. ok
70-test_wpacket.t .................. ok
80-test_ca.t ....................... ok
80-test_cipherbytes.t .............. ok
80-test_cipherlist.t ............... ok
80-test_ciphername.t ............... ok
80-test_cms.t ...................... ok
80-test_cmsapi.t ................... ok
80-test_ct.t ....................... ok
80-test_dane.t ..................... ok
80-test_dtls.t ..................... ok
80-test_dtls_mtu.t ................. ok
80-test_dtlsv1listen.t ............. ok
80-test_ocsp.t ..................... ok
80-test_pkcs12.t ................... ok
80-test_ssl_new.t .................. ok
80-test_ssl_old.t .................. 
Dubious, test returned 6 (wstat 1536, 0x600)
Failed 6/6 subtests 
80-test_ssl_test_ctx.t ............. ok
80-test_sslcorrupt.t ............... ok
80-test_tsa.t ...................... ok
80-test_x509aux.t .................. ok
90-test_asn1_time.t ................ ok
90-test_async.t .................... ok
90-test_bio_enc.t .................. ok
90-test_bio_memleak.t .............. ok
90-test_constant_time.t ............ ok
90-test_fatalerr.t ................. ok
90-test_gmdiff.t ................... ok
90-test_gost.t ..................... skipped: GOST support is disabled in this OpenSSL build
90-test_ige.t ...................... ok
90-test_includes.t ................. ok
90-test_memleak.t .................. ok
90-test_overhead.t ................. ok
90-test_secmem.t ................... ok
90-test_shlibload.t ................ skipped: Test only supported in a shared build
90-test_srp.t ...................... ok
90-test_sslapi.t ................... ok
90-test_sslbuffers.t ............... ok
90-test_store.t .................... ok
90-test_sysdefault.t ............... ok
90-test_threads.t .................. ok
90-test_time_offset.t .............. ok
90-test_tls13ccs.t ................. ok
90-test_tls13encryption.t .......... ok
90-test_tls13secrets.t ............. skipped: tls13secrets is not supported in this build
90-test_v3name.t ................... ok
95-test_external_boringssl.t ....... skipped: No external tests in this configuration
95-test_external_krb5.t ............ skipped: No external tests in this configuration
95-test_external_pyca.t ............ skipped: No external tests in this configuration
99-test_ecstress.t ................. ok
99-test_fuzz.t ..................... ok

Test Summary Report
-------------------
25-test_req.t                    (Wstat: 1024 Tests: 10 Failed: 4)
  Failed tests:  7-10
  Non-zero exit status: 4
25-test_verify_store.t           (Wstat: 256 Tests: 10 Failed: 1)
  Failed test:  4
  Non-zero exit status: 1
80-test_ssl_old.t                (Wstat: 1536 Tests: 6 Failed: 6)
  Failed tests:  1-6
  Non-zero exit status: 6
Files=184, Tests=1522, 321 wallclock secs ( 5.14 usr  1.04 sys + 305.73 cusr 20.85 csys = 332.76 CPU)
Result: FAIL
Makefile:1237: recipe for target '_tests' failed
make[1]: *** [_tests] Error 1
make[1]: Leaving directory '/home/openssl/run-checker/no-engine_no-shared'
Makefile:1235: recipe for target 'tests' failed
make: *** [tests] Error 2


More information about the openssl-commits mailing list