FAILED build of OpenSSL branch master with options -d --strict-warnings enable-weak-ssl-ciphers

OpenSSL run-checker openssl at openssl.org
Thu Sep 26 16:44:19 UTC 2019


Platform and configuration command:

$ uname -a
Linux run 4.15.0-54-generic #58-Ubuntu SMP Mon Jun 24 10:55:24 UTC 2019 x86_64 x86_64 x86_64 GNU/Linux
$ CC=clang ../openssl/config -d --strict-warnings enable-weak-ssl-ciphers

Commit log since last time:

42462e4016 Use OSSL_PARAM types.  Limits are explained in the description where appropriate.
72c162abb0 Use OSSL_PARAM types.  Limits are explained in the description where appropriate.
560ac83b0b KDF section 3 clean up
f49a65d09c Use OSSL_PARAM types for MAC documentation
e7f2dac968 Use OSSL_PARAM types for KDF documentation
19bd1fa1ef s390x assembly pack: accelerate X25519, X448, Ed25519 and Ed448
2281be2ed4 s390x assembly pack: cleanse only sensitive fields
ac037dc874 s390x assembly pack: fix OPENSSL_s390xcap z15 cpu mask
b3681e2641 s390x assembly pack: fix msa3 stfle bit detection
e6879a31ef Make EVP_MD_CTX_[gettable|settable]_params() take an EVP_MD_CTX
5a2a2f66c5 Remove the engine parameter from the provider MAC documentations
8d1502da1e Remove the engine parameter from the individual MAC documentation
9bd9c440c1 Remove engine param from EVP_KDF and EVP_MAC documentation
5053a3766a Remove engine param from the settable list
69db30449e Remove engine param macros from wrapper APIs
38cfb11d47 Make the "engine" parameter to some provider algorithms (KDF/PRF) hidden.
bafde18324 Add rc4 cipher to default provider

Build log ended with (last 100 lines):

30-test_pkey_meth_kdf.t ............ ok
40-test_rehash.t ................... ok
60-test_x509_check_cert_pkey.t ..... ok
60-test_x509_dup_cert.t ............ ok
60-test_x509_store.t ............... ok
60-test_x509_time.t ................ ok
70-test_asyncio.t .................. ok
70-test_bad_dtls.t ................. ok
70-test_clienthello.t .............. ok
70-test_comp.t ..................... ok
70-test_key_share.t ................ ok
70-test_packet.t ................... ok
70-test_recordlen.t ................ ok
70-test_renegotiation.t ............ ok
70-test_servername.t ............... ok
70-test_sslcbcpadding.t ............ ok
70-test_sslcertstatus.t ............ ok
70-test_sslextension.t ............. ok
70-test_sslmessages.t .............. ok
70-test_sslrecords.t ............... ok
70-test_sslsessiontick.t ........... ok
70-test_sslsigalgs.t ............... ok
70-test_sslsignature.t ............. ok
70-test_sslskewith0p.t ............. ok
70-test_sslversions.t .............. ok
70-test_sslvertol.t ................ ok
70-test_tls13alerts.t .............. ok
70-test_tls13cookie.t .............. ok
70-test_tls13downgrade.t ........... ok
70-test_tls13hrr.t ................. ok
70-test_tls13kexmodes.t ............ ok
70-test_tls13messages.t ............ ok
70-test_tls13psk.t ................. ok
70-test_tlsextms.t ................. ok
70-test_verify_extra.t ............. ok
70-test_wpacket.t .................. ok
80-test_ca.t ....................... ok
80-test_cipherbytes.t .............. ok
80-test_cipherlist.t ............... ok
80-test_ciphername.t ............... ok
80-test_cms.t ...................... ok
80-test_cmsapi.t ................... ok
80-test_ct.t ....................... ok
80-test_dane.t ..................... ok
80-test_dtls.t ..................... ok
80-test_dtls_mtu.t ................. ok
80-test_dtlsv1listen.t ............. ok
80-test_ocsp.t ..................... ok
80-test_pkcs12.t ................... ok
80-test_ssl_new.t .................. ok
80-test_ssl_old.t .................. 
Dubious, test returned 1 (wstat 256, 0x100)
Failed 1/6 subtests 
80-test_ssl_test_ctx.t ............. ok
80-test_sslcorrupt.t ............... ok
80-test_tsa.t ...................... ok
80-test_x509aux.t .................. ok
90-test_asn1_time.t ................ ok
90-test_async.t .................... ok
90-test_bio_enc.t .................. ok
90-test_bio_memleak.t .............. ok
90-test_constant_time.t ............ ok
90-test_fatalerr.t ................. ok
90-test_gmdiff.t ................... ok
90-test_gost.t ..................... ok
90-test_ige.t ...................... ok
90-test_includes.t ................. ok
90-test_memleak.t .................. ok
90-test_overhead.t ................. skipped: Only supported in no-shared builds
90-test_secmem.t ................... ok
90-test_shlibload.t ................ ok
90-test_srp.t ...................... ok
90-test_sslapi.t ................... ok
90-test_sslbuffers.t ............... ok
90-test_store.t .................... ok
90-test_sysdefault.t ............... ok
90-test_threads.t .................. ok
90-test_time_offset.t .............. ok
90-test_tls13ccs.t ................. ok
90-test_tls13encryption.t .......... ok
90-test_tls13secrets.t ............. ok
90-test_v3name.t ................... ok
95-test_external_boringssl.t ....... skipped: No external tests in this configuration
95-test_external_krb5.t ............ skipped: No external tests in this configuration
95-test_external_pyca.t ............ skipped: No external tests in this configuration
99-test_ecstress.t ................. ok
99-test_fuzz.t ..................... ok

Test Summary Report
-------------------
80-test_ssl_old.t                (Wstat: 256 Tests: 6 Failed: 1)
  Failed test:  3
  Non-zero exit status: 1
Files=177, Tests=1704, 310 wallclock secs ( 6.35 usr  1.04 sys + 289.92 cusr 27.01 csys = 324.32 CPU)
Result: FAIL
Makefile:198: recipe for target '_tests' failed
make[1]: *** [_tests] Error 1
make[1]: Leaving directory '/home/openssl/run-checker/enable-weak-ssl-ciphers'
Makefile:196: recipe for target 'tests' failed
make: *** [tests] Error 2


More information about the openssl-commits mailing list