[openssl-users] 1.1.1 pre1 tests failing on Solaris SPARC

Dennis Clarke dclarke at blastwave.org
Tue Feb 20 19:01:04 UTC 2018

On 20/02/18 01:50 PM, Dennis Clarke wrote:
> On 20/02/18 01:36 PM, Norm Green wrote:

Making progress here ...

/opt/developerstudio12.6/bin/c99  -I. -Icrypto/include -Iinclude 
-errfmt=error -erroff=%none -errshort=full -xstrconst -xildoff -m64 
-xmemalign=8s -xnolibmil -Xc -xcode=pic32 -xregs=no%appl -xlibmieee -mc 
-ftrap=%none -Qy -xs -g -xbuiltin=%none -xdebugformat=dwarf -xunroll=1 
-D_TS_ERRNO -DOPENSSLDIR="\"/usr/local/ssl\"" 
-DENGINESDIR="\"/usr/local/lib/engines-1.1\""  -c -o 
crypto/bio/bss_bio.o crypto/bio/bss_bio.c
"crypto/bio/bss_bio.c", line 244: error: undefined symbol: OSSL_SSIZE_MAX
"crypto/bio/bss_bio.c", line 400: error: undefined symbol: OSSL_SSIZE_MAX
c99: acomp failed for crypto/bio/bss_bio.c
gmake[1]: *** [Makefile:1781: crypto/bio/bss_bio.o] Error 2
gmake[1]: Leaving directory 
gmake: *** [Makefile:143: all] Error 2
corv $

let me track down that undef there


More information about the openssl-users mailing list