openssl-1.1.1-stable-SNAP-20200713 bug

The Doctor doctor at
Mon Jul 13 12:06:16 UTC 2020

Script started on Mon Jul 13 06:01:58 2020
You have mail.
root at doctor:/usr/source/openssl-1.1.1-stable-SNAP-20200713 # make

make depend && make _all
perl: warning: Setting locale failed.
perl: warning: Please check that your locale settings:
        LC_ALL = (unset),
        LANG = "en_GB"
    are supported and installed on your system.
perl: warning: Falling back to the standard locale ("C").
rm -f test/ectest
${LDCMD:-/usr/local/bin/clang10} -pthread -Wa,--noexecstack -Qunused-arguments -Wall -O3 -L.    -o test/ectest test/ectest.o  test/libtestutil.a -lcrypto -pthread 
ld: error: undefined symbol: EC_GROUP_get_field_type
>>> referenced by ectest.c
>>>               test/ectest.o:(custom_generator_test)

ld: error: undefined symbol: EC_GROUP_get0_field
>>> referenced by ectest.c
>>>               test/ectest.o:(custom_generator_test)
clang: error: linker command failed with exit code 1 (use -v to see invocation)
*** Error code 1

make[1]: stopped in /usr/source/openssl-1.1.1-stable-SNAP-20200713
*** Error code 1

make: stopped in /usr/source/openssl-1.1.1-stable-SNAP-20200713
root at doctor:/usr/source/openssl-1.1.1-stable-SNAP-20200713 # exit


Script done on Mon Jul 13 06:02:20 2020

openssl-1.1.1-stable-SNAP-20200712 was all right.

Please fix.

Member - Liberal International This is Ici
Yahweh, Queen & country!Never Satan President Republic!Beware AntiChrist rising!  
We were not instructed to succumb to the world.  -unknown

More information about the openssl-users mailing list