openssl-1.1.1-stable-SNAP-20200714 bug Re: openssl-1.1.1-stable-SNAP-20200713 bug

The Doctor doctor at
Tue Jul 14 13:06:56 UTC 2020

On Mon, Jul 13, 2020 at 08:02:06PM +0300, Nicola Tuveri wrote:
> I independently reached the same failure and I opened a github issue that
> references this report:
> The fix should be coming in the form of
> Thanks for reporting this issue!
> Cheers,
> Nicola Tuveri

 And this morning we get

Script started on Tue Jul 14 07:05:40 2020
root at doctor:/usr/source/openssl-1.1.1-stable-SNAP-20200714 # make

make depend && make _all
perl: warning: Setting locale failed.
perl: warning: Please check that your locale settings:
        LC_ALL = (unset),
        LANG = "en_GB"
    are supported and installed on your system.
perl: warning: Falling back to the standard locale ("C").
rm -f test/ectest
${LDCMD:-/usr/local/bin/clang10} -pthread -Wa,--noexecstack -Qunused-arguments -Wall -O3 -L.    -o test/ectest test/ectest.o  test/libtestutil.a -lcrypto -pthread 
ld: error: undefined symbol: EC_GROUP_get_field_type
>>> referenced by ectest.c
>>>               test/ectest.o:(custom_generator_test)

ld: error: undefined symbol: EC_GROUP_get0_field
>>> referenced by ectest.c
>>>               test/ectest.o:(custom_generator_test)
clang: error: linker command failed with exit code 1 (use -v to see invocation)
*** Error code 1

make[1]: stopped in /usr/source/openssl-1.1.1-stable-SNAP-20200714
*** Error code 1

make: stopped in /usr/source/openssl-1.1.1-stable-SNAP-20200714
root at doctor:/usr/source/openssl-1.1.1-stable-SNAP-20200714 # exit


Script done on Tue Jul 14 07:05:54 2020

Error in lines 2126 and 2127 of test/ectest.c

Member - Liberal International This is Ici
Yahweh, Queen & country!Never Satan President Republic!Beware AntiChrist rising!  
We were not instructed to succumb to the world.  -unknown

More information about the openssl-users mailing list