[openssl-project] Travis is currently failing

Kurt Roeckx kurt at roeckx.be
Tue May 1 09:52:46 UTC 2018

On Tue, May 01, 2018 at 10:02:31AM +0100, Matt Caswell wrote:
> Can anyone shed any light on this error from travis (master branch is
> failing):
> /usr/bin/ld: unrecognized option '--push-state--no-as-needed'
> /usr/bin/ld: use the --help option for usage information
> collect2: error: ld returned 1 exit status
> make[1]: *** [libcrypto.so] Error 1
> make[1]: Leaving directory `/home/travis/build/openssl/openssl'
> make: *** [tests] Error 2

We're also not the only one seeing that problem. We also have the
problem in the 1.1.0-stable branch for the same configuration.
I have no idea what changed.

More information about the openssl-project mailing list