[openssl-project] Travis is currently failing

Matt Caswell matt at openssl.org
Tue May 1 10:12:04 UTC 2018

On 01/05/18 10:52, Kurt Roeckx wrote:
> On Tue, May 01, 2018 at 10:02:31AM +0100, Matt Caswell wrote:
>> Can anyone shed any light on this error from travis (master branch is
>> failing):
>> /usr/bin/ld: unrecognized option '--push-state--no-as-needed'
>> /usr/bin/ld: use the --help option for usage information
>> collect2: error: ld returned 1 exit status
>> make[1]: *** [libcrypto.so] Error 1
>> make[1]: Leaving directory `/home/travis/build/openssl/openssl'
>> make: *** [tests] Error 2
> We're also not the only one seeing that problem. We also have the
> problem in the 1.1.0-stable branch for the same configuration.
> I have no idea what changed.

Looks like it could be a gcc problem:


Or rather possibly an ubuntu gcc problem?



More information about the openssl-project mailing list